Reaction Details
TargetB1 bradykinin receptor
LigandBDBM50157519
Substrate/Competitorn/a
Meas. Tech.ChEMBL_429973 (CHEMBL917703)
Ki 200±n/a nM
Citation Kuduk, SDNg, CFeng, DMWai, JMChang, RSHarrell, CMMurphy, KLRansom, RWReiss, DIvarsson, MMason, GBoyce, STang, CPrueksaritanont, TFreidinger, RMPettibone, DJBock, MG 2,3-diaminopyridine bradykinin B1 receptor antagonists. J Med Chem47:6439-42 (2004) 
 
B1 bradykinin receptor
Name:B1 bradykinin receptor
Type:Enzyme
Mol. Mass.:40508.87
Organism:Homo sapiens (Human)
Description:P46663
Residue:353
BDBM50157519
NameBDBM50157519
Synonyms:4'-[(3-pentanoylamino-pyridin-2-ylamino)-methyl]-biphenyl-2-carboxylic acid methyl ester | CHEMBL197462
TypeSmall organic molecule
Emp. Form.C25H27N3O3
Mol. Mass.417.5002
SMILESCCCCC(=O)Nc1cccnc1NCc1ccc(cc1)-c1ccccc1C(=O)OC