Reaction Details
TargetB1 bradykinin receptor
LigandBDBM50157513
Substrate/Competitorn/a
Meas. Tech.ChEMBL_429981 (CHEMBL917711)
Ki 35.7±n/a nM
Citation Kuduk, SDNg, CFeng, DMWai, JMChang, RSHarrell, CMMurphy, KLRansom, RWReiss, DIvarsson, MMason, GBoyce, STang, CPrueksaritanont, TFreidinger, RMPettibone, DJBock, MG 2,3-diaminopyridine bradykinin B1 receptor antagonists. J Med Chem47:6439-42 (2004) 
 
B1 bradykinin receptor
Name:B1 bradykinin receptor
Type:Enzyme Catalytic Domain
Mol. Mass.:38389.97
Organism:RAT
Description:B1 BRADYKININ BDKRB1 RAT::P97583
Residue:337
BDBM50157513
NameBDBM50157513
Synonyms:3-chloro-4'-{(R)-1-[4-chloro-3-(2-cyano-acetylamino)-pyridin-2-ylamino]-ethyl}-biphenyl-2-carboxylic acid methyl ester | CHEMBL221998
TypeSmall organic molecule
Emp. Form.C24H20Cl2N4O3
Mol. Mass.483.347
SMILESCOC(=O)c1c(Cl)cccc1-c1ccc(cc1)[C@@H](C)Nc1nccc(Cl)c1NC(=O)CC#N