Reaction Details
TargetAcetylcholinesterase
LigandBDBM50157597
Substrate/Competitorn/a
Meas. Tech.ChEMBL_430033 (CHEMBL917209)
Ki 5.67±n/a nM
Citation Tumiatti, VAndrisano, VBanzi, RBartolini, MMinarini, ARosini, MMelchiorre, C Structure-activity relationships of acetylcholinesterase noncovalent inhibitors based on a polyamine backbone. 3. Effect of replacing the inner polymethylene chain with cyclic moieties. J Med Chem47:6490-8 (2004) 
 
Acetylcholinesterase
Name:Acetylcholinesterase
Type:Enzyme
Mol. Mass.:67792.70
Organism:Homo sapiens (Human)
Description:P22303
Residue:614
BDBM50157597
NameBDBM50157597
Synonyms:6-[ethyl-(2-methoxy-benzyl)-amino]-1-(1'-{6-[ethyl-(2-methoxy-benzyl)-amino]-hexanoyl}-[4,4']bipiperidinyl-1-yl)-hexan-1-one, dioxalate CHEMBL254016
TypeSmall organic molecule
Emp. Form.C42H66N4O4
Mol. Mass.690.9978
SMILESCCN(CCCCCC(=O)N1CCC(CC1)C1CCN(CC1)C(=O)CCCCCN(CC)Cc1ccccc1OC)Cc1ccccc1OC