Reaction Details
TargetBeta-lactamase TEM
LigandBDBM50149467
Substrate/Competitorn/a
Meas. Tech.ChEMBL_430085 (CHEMBL918106)
IC50 1±n/a nM
Citation Venkatesan, AMGu, YDos Santos, OAbe, TAgarwal, AYang, YPetersen, PJWeiss, WJMansour, TSNukaga, MHujer, AMBonomo, RAKnox, JR Structure-activity relationship of 6-methylidene penems bearing tricyclic heterocycles as broad-spectrum beta-lactamase inhibitors: crystallographic structures show unexpected binding of 1,4-thiazepine intermediates. J Med Chem47:6556-68 (2004) 
 
Beta-lactamase TEM
Name:Beta-lactamase TEM
Type:Enzyme
Mol. Mass.:31512.33
Organism:Escherichia coli
Description:P62593
Residue:286
BDBM50149467
NameBDBM50149467
Synonyms:(5R,6Z)-6-(6,7-dihydro-5H-cyclopenta-[d]imidazo[2,1-b][1,3]thiazol-2-ylmethylene)-7-oxo-4-thia-1-azabicyclo[3.2.0]hept-2-ene-2-carboxylic acid sodium Sodium; (R)-6-[1-(6,7-dihydro-5H-cyclopenta[d]imidazo[2,1-b]thiazol-2-yl)-meth-(Z)-ylidene]-7-oxo-4-thia-1-aza-bicyclo[3.2.0]hept-2-ene-2-carboxylate | sodium (R)-6-[1-(6,7-dihydro-5H-cyclopenta[d]imidazo[2,1-b]thiazol-2-yl)-meth-(Z)-ylidene]-7-oxo-4-thia-1-aza-bicyclo[3.2.0]hept-2-ene-2-carboxylate
TypeSmall organic molecule
Emp. Form.C15H10N3O3S2
Mol. Mass.344.389
SMILES[O-]C(=O)C1=CS[C@H]2N1C(=O)\C2=C\c1cn2c3CCCc3sc2n1