Reaction Details
TargetAndrogen receptor
LigandBDBM50157821
Substrate/Competitorn/a
Meas. Tech.ChEMBL_317562 (CHEMBL825228)
Ki 9±n/a nM
Citation Salvati, MEBalog, AShan, WWei, DDPickering, DAttar, RMGeng, JRizzo, CAGottardis, MMWeinmann, RKrystek, SRSack, JAn, YKish, K Structure based approach to the design of bicyclic-1H-isoindole-1,3(2H)-dione based androgen receptor antagonists. Bioorg Med Chem Lett15:271-6 (2004) 
 
Androgen receptor
Name:Androgen receptor
Type:Receptor
Mol. Mass.:99185.27
Organism:Homo sapiens (Human)
Description:CHO cells were stably transfected with human AR gene.
Residue:920
BDBM50157821
NameBDBM50157821
Synonyms:(2R,6S,8S,10R)-4-[3-(trifluoromethyl)phenyl]-4-azatetracyclo[5.3.2.0^{2,6}.0^{8,10}]dodec-11-ene-3,5-dione | CHEMBL182993
TypeSmall organic molecule
Emp. Form.C18H14F3NO2
Mol. Mass.333.3045
SMILESOc1c2C3C=CC([C@@H]4C[C@H]34)c2c(O)n1-c1cccc(c1)C(F)(F)F