Reaction Details
TargetAndrogen receptor
LigandBDBM50157825
Substrate/Competitorn/a
Meas. Tech.ChEMBL_302725 (CHEMBL839595)
Ki 5±n/a nM
Citation Salvati, MEBalog, AShan, WWei, DDPickering, DAttar, RMGeng, JRizzo, CAGottardis, MMWeinmann, RKrystek, SRSack, JAn, YKish, K Structure based approach to the design of bicyclic-1H-isoindole-1,3(2H)-dione based androgen receptor antagonists. Bioorg Med Chem Lett15:271-6 (2004) 
 
Androgen receptor
Name:Androgen receptor
Type:Receptor
Mol. Mass.:99185.27
Organism:Homo sapiens (Human)
Description:CHO cells were stably transfected with human AR gene.
Residue:920
BDBM50157825
NameBDBM50157825
Synonyms:(2R,6S)-4-(4-Nitro-3-trifluoromethyl-phenyl)-4-aza-tricyclo[5.2.1.0*2,6*]decane-3,5-dione (2S,6R)-4-(4-Nitro-3-trifluoromethyl-phenyl)-4-aza-tricyclo[5.2.1.0*2,6*]decane-3,5-dione | CHEMBL178333
TypeSmall organic molecule
Emp. Form.C16H13F3N2O4
Mol. Mass.354.2806
SMILESOc1c2C3CCC(C3)c2c(O)n1-c1ccc(c(c1)C(F)(F)F)[N+]([O-])=O