Reaction Details
TargetDNA excision repair protein ERCC-5
LigandBDBM50157841
Substrate/Competitorn/a
Meas. Tech.ChEMBL_305129 (CHEMBL832425)
IC50 0.136±n/a nM
Citation Tumey, LNBom, DHuck, BGleason, EWang, JSilver, DBrunden, KBoozer, SRundlett, SSherf, BMurphy, SDent, TLeventhal, CBailey, AHarrington, JBennani, YL The identification and optimization of a N-hydroxy urea series of flap endonuclease 1 inhibitors. Bioorg Med Chem Lett15:277-81 (2004) 
 
DNA excision repair protein ERCC-5
Name:DNA excision repair protein ERCC-5
Type:PROTEIN
Mol. Mass.:133069.11
Organism:Homo sapiens (Human)
Description:ChEMBL_305129
Residue:1186
BDBM50157841
NameBDBM50157841
Synonyms:7-Biphenyl-4-yl-3-hydroxy-1H-furo[3,2-d]pyrimidine-2,4-dione | CHEMBL364591
TypeSmall organic molecule
Emp. Form.C18H12N2O4
Mol. Mass.320.2989
SMILESOn1c(=O)[nH]c2c(coc2c1=O)-c1ccc(cc1)-c1ccccc1