Reaction Details
TargetDNA excision repair protein ERCC-5
LigandBDBM50157835
Substrate/Competitorn/a
Meas. Tech.ChEMBL_305129 (CHEMBL832425)
IC50 0.258±n/a nM
Citation Tumey, LNBom, DHuck, BGleason, EWang, JSilver, DBrunden, KBoozer, SRundlett, SSherf, BMurphy, SDent, TLeventhal, CBailey, AHarrington, JBennani, YL The identification and optimization of a N-hydroxy urea series of flap endonuclease 1 inhibitors. Bioorg Med Chem Lett15:277-81 (2004) 
 
DNA excision repair protein ERCC-5
Name:DNA excision repair protein ERCC-5
Type:PROTEIN
Mol. Mass.:133069.11
Organism:Homo sapiens (Human)
Description:ChEMBL_305129
Residue:1186
BDBM50157835
NameBDBM50157835
Synonyms:7-tert-Butyl-3-hydroxy-1H-thieno[3,2-d]pyrimidine-2,4-dione | CHEMBL360615
TypeSmall organic molecule
Emp. Form.C10H12N2O3S
Mol. Mass.240.279
SMILESCC(C)(C)c1cc2[nH]c(=O)n(O)c(=O)c2s1