Reaction Details
TargetFlap endonuclease 1
LigandBDBM50157851
Substrate/Competitorn/a
Meas. Tech.ChEMBL_304960 (CHEMBL827838)
IC50 0.003±n/a nM
Citation Tumey, LNBom, DHuck, BGleason, EWang, JSilver, DBrunden, KBoozer, SRundlett, SSherf, BMurphy, SDent, TLeventhal, CBailey, AHarrington, JBennani, YL The identification and optimization of a N-hydroxy urea series of flap endonuclease 1 inhibitors. Bioorg Med Chem Lett15:277-81 (2004) 
 
Flap endonuclease 1
Name:Flap endonuclease 1
Type:PROTEIN
Mol. Mass.:42602.57
Organism:Homo sapiens (Human)
Description:ChEMBL_1517026
Residue:380
BDBM50157851
NameBDBM50157851
Synonyms:3''-(3-Hydroxy-2,4-dioxo-3,4-dihydro-2H-thieno[3,2-d]pyrimidin-1-ylmethyl)-biphenyl-4-carboxylic acid amide | CHEMBL181962
TypeSmall organic molecule
Emp. Form.C20H15N3O4S
Mol. Mass.393.416
SMILESNC(=O)c1ccc(cc1)-c1cccc(Cn2c3ccsc3c(=O)n(O)c2=O)c1