Reaction Details
TargetDNA excision repair protein ERCC-5
LigandBDBM50157853
Substrate/Competitorn/a
Meas. Tech.ChEMBL_305129 (CHEMBL832425)
IC50 0.185±n/a nM
Citation Tumey, LNBom, DHuck, BGleason, EWang, JSilver, DBrunden, KBoozer, SRundlett, SSherf, BMurphy, SDent, TLeventhal, CBailey, AHarrington, JBennani, YL The identification and optimization of a N-hydroxy urea series of flap endonuclease 1 inhibitors. Bioorg Med Chem Lett15:277-81 (2004) 
 
DNA excision repair protein ERCC-5
Name:DNA excision repair protein ERCC-5
Type:PROTEIN
Mol. Mass.:133069.11
Organism:Homo sapiens (Human)
Description:ChEMBL_305129
Residue:1186
BDBM50157853
NameBDBM50157853
Synonyms:5-Chloro-3-hydroxy-4a,8a-dihydro-1H-quinazoline-2,4-dione US11253521, No. 11
TypeSmall organic molecule
Emp. Form.C8H5ClN2O3
Mol. Mass.212.59
SMILESOn1c(=O)[nH]c2cccc(Cl)c2c1=O