Reaction Details
TargetCannabinoid receptor 1
LigandBDBM50511105
Substrate/Competitorn/a
Meas. Tech.ChEMBL_2184565 (CHEMBL5096647)
Ki 1000±n/a nM
Citation Sampson, PB Phytocannabinoid Pharmacology: Medicinal Properties of  J Nat Prod84:142-160 (2021) 
 
Cannabinoid receptor 1
Name:Cannabinoid receptor 1
Type:G Protein-Coupled Receptor (GPCR)
Mol. Mass.:52868.96
Organism:Homo sapiens (Human)
Description:P21554
Residue:472
BDBM50511105
NameBDBM50511105
Synonyms:GWP-42004 O-4394 Tetrahydrocannabivarin
TypeSmall organic molecule
Emp. Form.C19H26O2
Mol. Mass.286.4085
SMILES[H][C@@]12C=C(C)CC[C@@]1([H])C(C)(C)Oc1cc(CCC)cc(O)c21