Reaction Details
TargetCannabinoid receptor 1
LigandBDBM50587686
Substrate/Competitorn/a
Meas. Tech.ChEMBL_2184565 (CHEMBL5096647)
Ki 130±n/a nM
Citation Sampson, PB Phytocannabinoid Pharmacology: Medicinal Properties of  J Nat Prod84:142-160 (2021) 
 
Cannabinoid receptor 1
Name:Cannabinoid receptor 1
Type:G Protein-Coupled Receptor (GPCR)
Mol. Mass.:52868.96
Organism:Homo sapiens (Human)
Description:P21554
Residue:472
BDBM50587686
NameBDBM50587686
Synonyms:CHEMBL5171161
TypeSmall organic molecule
Emp. Form.C23H34O2
Mol. Mass.342.5149
SMILES[H][C@@]12C=C(C)CC[C@@]1([H])C(C)(C)Oc1cc(CCCCCCC)cc(O)c21