Reaction Details
TargetCannabinoid receptor 2
LigandBDBM50061117
Substrate/Competitorn/a
Meas. Tech.ChEMBL_2184580 (CHEMBL5096662)
Ki 70±n/a nM
Citation Sampson, PB Phytocannabinoid Pharmacology: Medicinal Properties of  J Nat Prod84:142-160 (2021) 
 
Cannabinoid receptor 2
Name:Cannabinoid receptor 2
Type:G Protein-Coupled Receptor (GPCR)
Mol. Mass.:39690.94
Organism:Homo sapiens (Human)
Description:P34972
Residue:360
BDBM50061117
NameBDBM50061117
Synonyms:6,6,9-Trimethyl-3-pentyl-6H-benzo[c]chromen-1-ol 6,6,9-Trimethyl-3-pentyl-6H-benzo[c]chromen-1-ol(Cannabinol) CBN | CHEMBL74415
TypeSmall organic molecule
Emp. Form.C21H26O2
Mol. Mass.310.4299
SMILESCCCCCc1cc(O)c-2c(OC(C)(C)c3ccc(C)cc-23)c1