Reaction Details
TargetCytochrome P450 2A6
LigandBDBM50061117
Substrate/Competitorn/a
Meas. Tech.ChEMBL_2184586 (CHEMBL5096668)
Ki 1000±n/a nM
Citation Sampson, PB Phytocannabinoid Pharmacology: Medicinal Properties of  J Nat Prod84:142-160 (2021) 
 
Cytochrome P450 2A6
Name:Cytochrome P450 2A6
Type:Protein
Mol. Mass.:56514.34
Organism:Homo sapiens (Human)
Description:P11509
Residue:494
BDBM50061117
NameBDBM50061117
Synonyms:6,6,9-Trimethyl-3-pentyl-6H-benzo[c]chromen-1-ol 6,6,9-Trimethyl-3-pentyl-6H-benzo[c]chromen-1-ol(Cannabinol) CBN | CHEMBL74415
TypeSmall organic molecule
Emp. Form.C21H26O2
Mol. Mass.310.4299
SMILESCCCCCc1cc(O)c-2c(OC(C)(C)c3ccc(C)cc-23)c1