Reaction Details
TargetCannabinoid receptor 1
LigandBDBM50318487
Substrate/Competitorn/a
Meas. Tech.ChEMBL_2184592 (CHEMBL5096674)
Ki 440±n/a nM
Citation Sampson, PB Phytocannabinoid Pharmacology: Medicinal Properties of  J Nat Prod84:142-160 (2021) 
 
Cannabinoid receptor 1
Name:Cannabinoid receptor 1
Type:G Protein-Coupled Receptor (GPCR)
Mol. Mass.:52856.55
Organism:Rattus norvegicus (rat)
Description:P20272
Residue:473
BDBM50318487
NameBDBM50318487
Synonyms:CHEMBL497318 | Cannabigerol
TypeSmall organic molecule
Emp. Form.C21H32O2
Mol. Mass.316.4776
SMILES[#6]-[#6]-[#6]-[#6]-[#6]-c1cc(-[#8])c(-[#6]\[#6]=[#6](/[#6])-[#6]-[#6]\[#6]=[#6](\[#6])-[#6])c(-[#8])c1