Reaction Details
TargetGamma-secretase subunit APH-1A/Gamma-secretase subunit APH-1B/Gamma-secretase subunit PEN-2/Nicastrin/Presenilin-1/Presenilin-2
LigandBDBM50157972
Substrate/Competitorn/a
Meas. Tech.ChEMBL_305784 (CHEMBL827973)
IC50 75±n/a nM
Citation Lewis, SJSmith, ALNeduvelil, JGStevenson, GILindon, MJJones, ABShearman, MSBeher, DClarke, EBest, JDPeachey, JEHarrison, TCastro, JL A novel series of potent gamma-secretase inhibitors based on a benzobicyclo[4.2.1]nonane core. Bioorg Med Chem Lett15:373-8 (2004) 
 
Gamma-secretase subunit APH-1A/Gamma-secretase subunit APH-1B/Gamma-secretase subunit PEN-2/Nicastrin/Presenilin-1/Presenilin-2
Name:Gamma-secretase subunit APH-1A/Gamma-secretase subunit APH-1B/Gamma-secretase subunit PEN-2/Nicastrin/Presenilin-1/Presenilin-2
Type:n/a
Mol. Mass.:n/a
Description:ASSAY_ID of EBI is 68900
Components:This complex has 6 components.
Component 1
Name:Gamma-secretase subunit APH-1B
Synonyms:APH-1b APH1B_HUMAN Gamma-secretase PSFL | Presenilin-stabilization factor-like
Type:PROTEIN
Mol. Mass.:28468.17
Organism:Homo sapiens (Human)
Description:EBI_10231
Residue:257
Component 2
Name:Presenilin-2
Synonyms:AD3LP AD5 Gamma-secretase PS2 PSN2_HUMAN Presenilin 2 Presenilin-2 CTF subunit STM-2 | STM2
Type:PROTEIN
Mol. Mass.:50116.65
Organism:Homo sapiens (Human)
Description:ChEMBL_855576
Residue:448
Component 3
Name:Gamma-secretase subunit APH-1A
Synonyms:APH-1a APH1A_HUMAN Gamma-Secretase Subunit APH-1A Presenilin-stabilization factor
Type:Enzyme subunit; multi-pass membrane protein
Mol. Mass.:28998.73
Organism:Homo sapiens (Human)
Description:n/a
Residue:265
Component 4
Name:Nicastrin
Synonyms:Gamma-secretase NCSTN Nicastrin
Type:PROTEIN
Mol. Mass.:78404.96
Organism:Homo sapiens (Human)
Description:EBI_10683
Residue:709
Component 5
Name:Presenilin-1
Synonyms:3.4.23.- Gamma-Secretase Subunit Presenilin-1 PS1 PSEN1 PSNL1 Presenilin-1 CTF12 Protein S182
Type:n/a
Mol. Mass.:52657.13
Organism:Homo sapiens (Human)
Description:P49768
Residue:467
Component 6
Name:Gamma-secretase subunit PEN-2
Synonyms:Gamma-Secretase Subunit PEN-2 PEN2 PSENEN | Presenilin enhancer protein 2
Type:Enzyme subunit; multi-pass membrane protein
Mol. Mass.:12031.98
Organism:Homo sapiens (Human)
Description:n/a
Residue:101
BDBM50157972
NameBDBM50157972
Synonyms:CHEMBL183585 | Pyridine-2-carboxylic acid (13-benzenesulfonylamino-tricyclo[8.2.1.0*3,8*]trideca-3(8),4,6-trien-5-yl)-amide
TypeSmall organic molecule
Emp. Form.C25H25N3O3S
Mol. Mass.447.549
SMILESO=C(Nc1ccc2CC3CCC(Cc2c1)C3NS(=O)(=O)c1ccccc1)c1ccccn1