Reaction Details
TargetPotassium voltage-gated channel subfamily A member 3
LigandBDBM50158207
Substrate/Competitorn/a
Meas. Tech.ChEMBL_312359 (CHEMBL837472)
IC50 80±n/a nM
Citation Bao, JMiao, SKayser, FKotliar, AJBaker, RKDoss, GAFelix, JPBugianesi, RMSlaughter, RSKaczorowski, GJGarcia, MLHa, SNCastonguay, LKoo, GCShah, KSpringer, MSStaruch, MJParsons, WHRupprecht, KM Potent Kv1.3 inhibitors from correolide-modification of the C18 position. Bioorg Med Chem Lett15:447-51 (2004) 
 
Potassium voltage-gated channel subfamily A member 3
Name:Potassium voltage-gated channel subfamily A member 3
Type:PROTEIN
Mol. Mass.:63835.47
Organism:Homo sapiens (Human)
Description:ChEMBL_1513935
Residue:575
BDBM50158207
NameBDBM50158207
Synonyms:Aceticacid(R)-1-{(4R,4aR,5S,6R,6aR,11bS)-4,5,6-triacetoxy--[2-(2-ethoxy-phenyl)-ethyl]-1-hydroxy-2,4a,11b-trimethyl-1,,3,4,4a,4b,5,6,9,11a,11b,12,13,13a-tetradecahydro-8-oxa-cyclohepta[a]phenanthren-6a-yl}-ethyl ester | CHEMBL425865
TypeSmall organic molecule
Emp. Form.C41H56O11
Mol. Mass.724.8767
SMILESCCOc1ccccc1CCC1(O)C2CC[C@@]3(C)C4C=CCOC[C@]4([C@@H](C)OC(C)=O)[C@@H](OC(C)=O)[C@@H](OC(C)=O)C3[C@@]2(C)[C@H](OC(C)=O)C=C1C