Reaction Details
TargetBifunctional purine biosynthesis protein ATIC
LigandBDBM50158382
Substrate/Competitorn/a
Meas. Tech.ChEMBL_430370 (CHEMBL914875)
IC50 9600±n/a nM
Citation Li, CXu, LWolan, DWWilson, IAOlson, AJ Virtual screening of human 5-aminoimidazole-4-carboxamide ribonucleotide transformylase against the NCI diversity set by use of AutoDock to identify novel nonfolate inhibitors. J Med Chem47:6681-90 (2004) 
 
Bifunctional purine biosynthesis protein ATIC
Name:Bifunctional purine biosynthesis protein ATIC
Type:Protein
Mol. Mass.:64616.62
Organism:Homo sapiens (Human)
Description:P31939
Residue:592
BDBM50158382
NameBDBM50158382
Synonyms:CHEMBL376528 NSC-126445
TypeSmall organic molecule
Emp. Form.C34H52N2O2S
Mol. Mass.552.854
SMILESCC(C)CCC[C@@H](C)[C@H]1CC[C@H]2[C@@H]3CCC4=CC(CC[C@]4(C)[C@H]3CC[C@]12C)=NNS(=O)(=O)c1ccc(C)cc1