Reaction Details
TargetBifunctional purine biosynthesis protein ATIC
LigandBDBM50158383
Substrate/Competitorn/a
Meas. Tech.ChEMBL_430370 (CHEMBL914875)
IC50 13900±n/a nM
Citation Li, CXu, LWolan, DWWilson, IAOlson, AJ Virtual screening of human 5-aminoimidazole-4-carboxamide ribonucleotide transformylase against the NCI diversity set by use of AutoDock to identify novel nonfolate inhibitors. J Med Chem47:6681-90 (2004) 
 
Bifunctional purine biosynthesis protein ATIC
Name:Bifunctional purine biosynthesis protein ATIC
Type:Protein
Mol. Mass.:64616.62
Organism:Homo sapiens (Human)
Description:P31939
Residue:592
BDBM50158383
NameBDBM50158383
Synonyms:2-((8S,9S,10R,13S,14S,17S)-10,13-dimethyl-3-oxo-2,3,6,7,8,9,10,11,12,13,14,15,16,17-tetradecahydro-1H-cyclopenta[a]phenanthren-17-yl)-2-oxoethyl 4-bromobenzenesulfonate 4-Pregnen-21-ol-3,20-dione-21-(4-bromobenzenesufonate) NSC-88915
TypeSmall organic molecule
Emp. Form.C27H33BrO5S
Mol. Mass.549.517
SMILESC[C@]12CC[C@H]3[C@@H](CCC4=CC(=O)CC[C@]34C)[C@@H]1CC[C@@H]2C(=O)COS(=O)(=O)c1ccc(Br)cc1