Reaction Details
TargetBifunctional purine biosynthesis protein ATIC
LigandBDBM50158386
Substrate/Competitorn/a
Meas. Tech.ChEMBL_430370 (CHEMBL914875)
IC50 11600±n/a nM
Citation Li, CXu, LWolan, DWWilson, IAOlson, AJ Virtual screening of human 5-aminoimidazole-4-carboxamide ribonucleotide transformylase against the NCI diversity set by use of AutoDock to identify novel nonfolate inhibitors. J Med Chem47:6681-90 (2004) 
 
Bifunctional purine biosynthesis protein ATIC
Name:Bifunctional purine biosynthesis protein ATIC
Type:Protein
Mol. Mass.:64616.62
Organism:Homo sapiens (Human)
Description:P31939
Residue:592
BDBM50158386
NameBDBM50158386
Synonyms:5-hydroxy-8-[4-(4-sulfo-phenylazo)-phenylazo]-naphthalene-1-sulfonic acid | CHEMBL376026
TypeSmall organic molecule
Emp. Form.C22H16N4O7S2
Mol. Mass.512.515
SMILESOc1ccc(N=Nc2ccc(cc2)N=Nc2ccc(cc2)S(O)(=O)=O)c2c(cccc12)S(O)(=O)=O