Reaction Details
TargetMitogen-activated protein kinase 9
LigandBDBM50158551
Substrate/Competitorn/a
Meas. Tech.ChEMBL_420030 (CHEMBL854698)
IC50 650±n/a nM
Citation Rückle, TBiamonte, MGrippi-Vallotton, TArkinstall, SCambet, YCamps, MChabert, CChurch, DJHalazy, SJiang, XMartinou, INichols, ASauer, WGotteland, JP Design, synthesis, and biological activity of novel, potent, and selective (benzoylaminomethyl)thiophene sulfonamide inhibitors of c-Jun-N-terminal kinase. J Med Chem47:6921-34 (2004) 
 
Mitogen-activated protein kinase 9
Name:Mitogen-activated protein kinase 9
Type:Enzyme
Mol. Mass.:48131.49
Organism:Homo sapiens (Human)
Description:JNK-2 was purchased from Upstate Cell Signaling Solutions (formerly Upstate Biotechnology).
Residue:424
BDBM50158551
NameBDBM50158551
Synonyms:CHEMBL383955 N-5-4-1H-benzo[d][1,2,3]triazol-1-yl)piperidin-1-ylsulfonyl)thiophen-2-yl)methyl)-4-chlorobenzamide
TypeSmall organic molecule
Emp. Form.C23H22ClN5O3S2
Mol. Mass.516.035
SMILESClc1ccc(cc1)C(=O)NCc1ccc(s1)S(=O)(=O)N1CCC(CC1)n1nnc2ccccc12