Reaction Details
TargetReduced folate transporter
LigandBDBM50158569
Substrate/Competitorn/a
Meas. Tech.ChEMBL_430664 (CHEMBL919632)
Ki 280±n/a nM
Citation Rosowsky, AForsch, RAWright, JE Synthesis and in vitro antifolate activity of rotationally restricted aminopterin and methotrexate analogues. J Med Chem47:6958-63 (2004) 
 
Reduced folate transporter
Name:Reduced folate transporter
Type:PROTEIN
Mol. Mass.:64885.16
Organism:Homo sapiens (Human)
Description:ChEMBL_1469594
Residue:591
BDBM50158569
NameBDBM50158569
Synonyms:2-S-[5-[2,4-diaminopteridin-6-yl)methyamino]-2,3-dihydro-1-oxo--2(1H)-isoindolyl glutaric acid | CHEMBL390990
TypeSmall organic molecule
Emp. Form.C20H20N8O5
Mol. Mass.452.4234
SMILESNc1nc(N)c2nc(CNc3ccc4C(=O)N(Cc4c3)[C@@H](CCC(O)=O)C(O)=O)cnc2n1