Reaction Details
TargetReverse transcriptase/RNaseH
LigandBDBM50158748
Substrate/Competitorn/a
Meas. Tech.ChEMBL_306221 (CHEMBL831129)
IC50 100000±n/a nM
Citation Dayam, RSanchez, TClement, OShoemaker, RSei, SNeamati, N Beta-diketo acid pharmacophore hypothesis. 1. Discovery of a novel class of HIV-1 integrase inhibitors. J Med Chem48:111-20 (2005) 
 
Reverse transcriptase/RNaseH
Name:Reverse transcriptase/RNaseH
Type:PROTEIN
Mol. Mass.:65229.15
Organism:Human immunodeficiency virus 1
Description:ChEMBL_1473730
Residue:566
BDBM50158748
NameBDBM50158748
Synonyms:CHEMBL368194 | N-(4-Hydroxy-phenyl)-3-{5-[1-(2-methoxy-phenyl)-meth-(E)-ylidene]-4-oxo-2-thioxo-thiazolidin-3-yl}-propionamide
TypeSmall organic molecule
Emp. Form.C20H18N2O4S2
Mol. Mass.414.498
SMILESCOc1ccccc1\C=C1\SC(=S)N(CCC(=O)Nc2ccc(O)cc2)C1=O