Reaction Details
TargetHistamine H3 receptor
LigandBDBM50159113
Substrate/Competitorn/a
Meas. Tech.ChEMBL_303027 (CHEMBL830414)
Ki 1.1±n/a nM
Citation Zaragoza, FStephensen, HPeschke, BRimvall, K 2-(4-alkylpiperazin-1-yl)quinolines as a new class of imidazole-free histamine H3 receptor antagonists. J Med Chem48:306-11 (2005) 
 
Histamine H3 receptor
Name:Histamine H3 receptor
Type:G Protein-Coupled Receptor (GPCR)
Mol. Mass.:48691.47
Organism:Homo sapiens (Human)
Description:Binding assays were using CHO cells stably expressing hH3R receptors.
Residue:445
BDBM50159113
NameBDBM50159113
Synonyms:2-(4-Cyclopropyl-piperazin-1-yl)-6-pyrazol-1-yl-quinoline | CHEMBL360997
TypeSmall organic molecule
Emp. Form.C19H21N5
Mol. Mass.319.4035
SMILESC1CC1N1CCN(CC1)c1ccc2cc(ccc2n1)-n1cccn1