Reaction Details
TargetHistamine H3 receptor
LigandBDBM50159115
Substrate/Competitorn/a
Meas. Tech.ChEMBL_303027 (CHEMBL830414)
Ki 110±n/a nM
Citation Zaragoza, FStephensen, HPeschke, BRimvall, K 2-(4-alkylpiperazin-1-yl)quinolines as a new class of imidazole-free histamine H3 receptor antagonists. J Med Chem48:306-11 (2005) 
 
Histamine H3 receptor
Name:Histamine H3 receptor
Type:G Protein-Coupled Receptor (GPCR)
Mol. Mass.:48691.47
Organism:Homo sapiens (Human)
Description:Binding assays were using CHO cells stably expressing hH3R receptors.
Residue:445
BDBM50159115
NameBDBM50159115
Synonyms:CHEMBL179306 | [2-(4-Cyclopropyl-piperazin-1-yl)-quinolin-6-yl]-(4-fluoro-phenyl)-methanone
TypeSmall organic molecule
Emp. Form.C23H22FN3O
Mol. Mass.375.4387
SMILESFc1ccc(cc1)C(=O)c1ccc2nc(ccc2c1)N1CCN(CC1)C1CC1