Reaction Details
TargetCannabinoid receptor 1
LigandBDBM50160443
Substrate/Competitorn/a
Meas. Tech.ChEMBL_302577 (CHEMBL839538)
Ki 84±n/a nM
Citation Lavey, BJKozlowski, JAHipkin, RWGonsiorek, WLundell, DJPiwinski, JJNarula, SLunn, CA Triaryl bis-sulfones as a new class of cannabinoid CB2 receptor inhibitors: identification of a lead and initial SAR studies. Bioorg Med Chem Lett15:783-6 (2005) 
 
Cannabinoid receptor 1
Name:Cannabinoid receptor 1
Type:G Protein-Coupled Receptor (GPCR)
Mol. Mass.:52868.96
Organism:Homo sapiens (Human)
Description:P21554
Residue:472
BDBM50160443
NameBDBM50160443
Synonyms:3,4-Dichloro-N-((S)-1-{4-[4-methoxy-2-(4-methoxy-benzenesulfonyl)-benzenesulfonyl]-phenyl}-ethyl)-benzamide | CHEMBL362822
TypeSmall organic molecule
Emp. Form.C29H25Cl2NO7S2
Mol. Mass.634.547
SMILESCOc1ccc(cc1)S(=O)(=O)c1cc(OC)ccc1S(=O)(=O)c1ccc(cc1)[C@H](C)NC(=O)c1ccc(Cl)c(Cl)c1