Reaction Details
TargetCannabinoid receptor 1
LigandBDBM50160438
Substrate/Competitorn/a
Meas. Tech.ChEMBL_302577 (CHEMBL839538)
Ki 3559±n/a nM
Citation Lavey, BJKozlowski, JAHipkin, RWGonsiorek, WLundell, DJPiwinski, JJNarula, SLunn, CA Triaryl bis-sulfones as a new class of cannabinoid CB2 receptor inhibitors: identification of a lead and initial SAR studies. Bioorg Med Chem Lett15:783-6 (2005) 
 
Cannabinoid receptor 1
Name:Cannabinoid receptor 1
Type:G Protein-Coupled Receptor (GPCR)
Mol. Mass.:52868.96
Organism:Homo sapiens (Human)
Description:P21554
Residue:472
BDBM50160438
NameBDBM50160438
Synonyms:CHEMBL181677 | N-((S)-1-{4-[4-Methoxy-2-(4-methoxy-benzenesulfonyl)-benzenesulfonyl]-phenyl}-ethyl)-propionamide
TypeSmall organic molecule
Emp. Form.C25H27NO7S2
Mol. Mass.517.614
SMILESCCC(=O)N[C@@H](C)c1ccc(cc1)S(=O)(=O)c1ccc(OC)cc1S(=O)(=O)c1ccc(OC)cc1