Reaction Details
TargetGonadotropin-releasing hormone receptor
LigandBDBM50160511
Substrate/Competitorn/a
Meas. Tech.ChEMBL_305635 (CHEMBL828667)
IC50 20±n/a nM
Citation Li, YKataoka, MTatsuta, MYasoshima, KYura, TUrbahns, KKiba, AYamamoto, NGupta, JBHashimoto, K Benzimidazole derivatives as novel nonpeptide luteinizing hormone-releasing hormone (LHRH) antagonists. Part 2: Benzimidazole-5-sulfonamides. Bioorg Med Chem Lett15:805-7 (2005) 
 
Gonadotropin-releasing hormone receptor
Name:Gonadotropin-releasing hormone receptor
Type:Enzyme
Mol. Mass.:37749.45
Organism:Homo sapiens (Human)
Description:P30968
Residue:328
BDBM50160511
NameBDBM50160511
Synonyms:1-Benzyl-2-[2-(3-tert-butyl-ureido)-ethyl]-1H-benzoimidazole-5-sulfonic acid 4-fluoro-benzylamide | CHEMBL413062
TypeSmall organic molecule
Emp. Form.C28H32FN5O3S
Mol. Mass.537.649
SMILESCC(C)(C)NC(=O)NCCc1nc2cc(ccc2n1Cc1ccccc1)S(=O)(=O)NCc1ccc(F)cc1