Reaction Details
TargetGonadotropin-releasing hormone receptor
LigandBDBM50410086
Substrate/Competitorn/a
Meas. Tech.ChEMBL_305571 (CHEMBL827165)
IC50 30±n/a nM
Citation Li, YKataoka, MTatsuta, MYasoshima, KYura, TUrbahns, KKiba, AYamamoto, NGupta, JBHashimoto, K Benzimidazole derivatives as novel nonpeptide luteinizing hormone-releasing hormone (LHRH) antagonists. Part 2: Benzimidazole-5-sulfonamides. Bioorg Med Chem Lett15:805-7 (2005) 
 
Gonadotropin-releasing hormone receptor
Name:Gonadotropin-releasing hormone receptor
Type:PROTEIN
Mol. Mass.:37767.60
Organism:Rattus norvegicus
Description:ChEMBL_1335047
Residue:327
BDBM50410086
NameBDBM50410086
Synonyms:CHEMBL2096778
TypeSmall organic molecule
Emp. Form.C29H34FN5O3S
Mol. Mass.551.675
SMILESCC(C)(C)CNC(=O)NCCc1nc2cc(ccc2n1Cc1ccccc1)S(=O)(=O)NCc1ccc(F)cc1