Reaction Details
Target5-hydroxytryptamine receptor 1A
LigandBDBM50160605
Substrate/Competitorn/a
Meas. Tech.ChEMBL_303397 (CHEMBL840060)
Ki 22.4±n/a nM
Citation Evrard, DAZhou, PYi, SYZhou, DSmith, DLSullivan, KMHornby, GASchechter, LEAndree, THMewshaw, RE Studies towards the next generation of antidepressants. Part 4: derivatives of 4-(5-fluoro-1H-indol-3-yl)cyclohexylamine with affinity for the serotonin transporter and the 5-HT1A receptor. Bioorg Med Chem Lett15:911-4 (2005) 
 
5-hydroxytryptamine receptor 1A
Name:5-hydroxytryptamine receptor 1A
Type:n/a
Mol. Mass.:46122.49
Organism:Homo sapiens (Human)
Description:n/a
Residue:422
BDBM50160605
NameBDBM50160605
Synonyms:CHEMBL359505 | [4-(5-Fluoro-1H-indol-3-yl)-cyclohexyl]-[2-(2-methoxy-phenoxy)-ethyl]-amine
TypeSmall organic molecule
Emp. Form.C23H27FN2O2
Mol. Mass.382.4711
SMILESCOc1ccccc1OCCN[C@H]1CC[C@@H](CC1)c1c[nH]c2ccc(F)cc12