Reaction Details
TargetSodium-dependent serotonin transporter
LigandBDBM50160608
Substrate/Competitorn/a
Meas. Tech.ChEMBL_303700 (CHEMBL828187)
Ki 14.1±n/a nM
Citation Evrard, DAZhou, PYi, SYZhou, DSmith, DLSullivan, KMHornby, GASchechter, LEAndree, THMewshaw, RE Studies towards the next generation of antidepressants. Part 4: derivatives of 4-(5-fluoro-1H-indol-3-yl)cyclohexylamine with affinity for the serotonin transporter and the 5-HT1A receptor. Bioorg Med Chem Lett15:911-4 (2005) 
 
Sodium-dependent serotonin transporter
Name:Sodium-dependent serotonin transporter
Type:Multi-pass membrane protein
Mol. Mass.:70168.43
Organism:Rattus norvegicus (rat)
Description:P31652
Residue:630
BDBM50160608
NameBDBM50160608
Synonyms:(2,3-Dihydro-benzo[1,4]dioxin-2-ylmethyl)-[4-(5-fluoro-1H-indol-3-yl)-cyclohexyl]-amine | CHEMBL362430
TypeSmall organic molecule
Emp. Form.C23H25FN2O2
Mol. Mass.380.4552
SMILESFc1ccc2[nH]cc([C@H]3CC[C@@H](CC3)NCC3COc4ccccc4O3)c2c1