Reaction Details
Target3-hydroxy-3-methylglutaryl-coenzyme A reductase
LigandBDBM50160720
Substrate/Competitorn/a
Meas. Tech.ChEMBL_305262 (CHEMBL832812)
IC50 4000±n/a nM
Citation Medina-Franco, JLLópez-Vallejo, FRodríguez-Morales, SCastillo, RChamorro, GTamariz, J Molecular docking of the highly hypolipidemic agent alpha-asarone with the catalytic portion of HMG-CoA reductase. Bioorg Med Chem Lett15:989-94 (2005) 
 
3-hydroxy-3-methylglutaryl-coenzyme A reductase
Name:3-hydroxy-3-methylglutaryl-coenzyme A reductase
Type:Enzyme
Mol. Mass.:97477.10
Organism:Homo sapiens (Human)
Description:P04035
Residue:888
BDBM50160720
NameBDBM50160720
Synonyms:3-hydroxy-3-methylglutaric acid CHEMBL50444 meglutol
TypeSmall organic molecule
Emp. Form.C6H10O5
Mol. Mass.162.1406
SMILESCC(O)(CC(O)=O)CC(O)=O