Reaction Details
TargetTubulin beta chain [1-43]
LigandBDBM50160798
Substrate/Competitorn/a
Meas. Tech.ChEMBL_311916 (CHEMBL834683)
IC50 30000±n/a nM
Citation Morita, HKoyama, KSugimoto, YKobayashi, J Antimitotic activity and reversal of breast cancer resistance protein-mediated drug resistance by stilbenoids from Bletilla striata. Bioorg Med Chem Lett15:1051-4 (2005) 
 
Tubulin beta chain [1-43]
Name:Tubulin beta chain [1-43]
Type:PROTEIN
Mol. Mass.:4652.47
Organism:Leishmania donovani
Description:ChEMBL_311916
Residue:43
BDBM50160798
NameBDBM50160798
Synonyms:4,4''-Dimethoxy-9,10-dihydro-[1,1'']biphenanthrenyl-2,7,2'',7''-tetraol Cirrhopetalanthrin
TypeSmall organic molecule
Emp. Form.C30H24O6
Mol. Mass.480.508
SMILESCOc1cc(O)c(c2CCc3cc(O)ccc3-c12)-c1c(O)cc(OC)c2c1ccc1cc(O)ccc21