Reaction Details
TargetTubulin beta chain [1-43]
LigandBDBM50160800
Substrate/Competitorn/a
Meas. Tech.ChEMBL_311916 (CHEMBL834683)
IC50 30000±n/a nM
Citation Morita, HKoyama, KSugimoto, YKobayashi, J Antimitotic activity and reversal of breast cancer resistance protein-mediated drug resistance by stilbenoids from Bletilla striata. Bioorg Med Chem Lett15:1051-4 (2005) 
 
Tubulin beta chain [1-43]
Name:Tubulin beta chain [1-43]
Type:PROTEIN
Mol. Mass.:4652.47
Organism:Leishmania donovani
Description:ChEMBL_311916
Residue:43
BDBM50160800
NameBDBM50160800
Synonyms:1,3-Bis-(4-hydroxy-benzyl)-4-methoxy-9,10-dihydro-phenanthrene-2,7-diol | CHEMBL181587
TypeSmall organic molecule
Emp. Form.C29H26O5
Mol. Mass.454.5137
SMILESCOc1c(Cc2ccc(O)cc2)c(O)c(Cc2ccc(O)cc2)c2CCc3cc(O)ccc3-c12