Reaction Details
TargetTubulin beta chain [1-43]
LigandBDBM50160805
Substrate/Competitorn/a
Meas. Tech.ChEMBL_311916 (CHEMBL834683)
IC50 30000±n/a nM
Citation Morita, HKoyama, KSugimoto, YKobayashi, J Antimitotic activity and reversal of breast cancer resistance protein-mediated drug resistance by stilbenoids from Bletilla striata. Bioorg Med Chem Lett15:1051-4 (2005) 
 
Tubulin beta chain [1-43]
Name:Tubulin beta chain [1-43]
Type:PROTEIN
Mol. Mass.:4652.47
Organism:Leishmania donovani
Description:ChEMBL_311916
Residue:43
BDBM50160805
NameBDBM50160805
Synonyms:1-(4-Hydroxy-benzyl)-4,8-dimethoxy-phenanthrene-2,7-diol | CHEMBL181441
TypeSmall organic molecule
Emp. Form.C23H20O5
Mol. Mass.376.4019
SMILESCOc1cc(O)c(Cc2ccc(O)cc2)c2ccc3c(OC)c(O)ccc3c12