Reaction Details
Target5-hydroxytryptamine receptor 2A
LigandBDBM50160806
Substrate/Competitorn/a
Meas. Tech.ChEMBL_303232 (CHEMBL827197)
Ki 18.5±n/a nM
Citation Ochi, TSakamoto, MMinamida, ASuzuki, KUeda, TUne, TToda, HMatsumoto, KTerauchi, Y Syntheses and properties of the major hydroxy metabolites in humans of blonanserin AD-5423, a novel antipsychotic agent. Bioorg Med Chem Lett15:1055-9 (2005) 
 
5-hydroxytryptamine receptor 2A
Name:5-hydroxytryptamine receptor 2A
Type:undefined
Mol. Mass.:52607.65
Organism:Homo sapiens (Human)
Description:P28223
Residue:471
BDBM50160806
NameBDBM50160806
Synonyms:4-(4-Fluoro-phenyl)-2-(4-propyl-piperazin-1-yl)-5,6,7,8,9,10-hexahydro-cycloocta[b]pyridin-7-ol | CHEMBL362285
TypeSmall organic molecule
Emp. Form.C23H30FN3O
Mol. Mass.383.5022
SMILESCCN1CCN(CC1)c1cc(-c2ccc(F)cc2)c2CC[C@@H](O)CCCc2n1