Reaction Details
TargetProstaglandin E2 receptor EP1 subtype
LigandBDBM50160907
Substrate/Competitorn/a
Meas. Tech.ChEMBL_303322 (CHEMBL840047)
Ki 90±n/a nM
Citation Ducharme, YBlouin, MCarrière, MCChateauneuf, ACôté, BDenis, DFrenette, RGreig, GKargman, SLamontagne, SMartins, ENantel, FO'Neill, GSawyer, NMetters, KMFriesen, RW 2,3-Diarylthiophenes as selective EP1 receptor antagonists. Bioorg Med Chem Lett15:1155-60 (2005) 
 
Prostaglandin E2 receptor EP1 subtype
Name:Prostaglandin E2 receptor EP1 subtype
Type:Enzyme
Mol. Mass.:41834.57
Organism:Homo sapiens (Human)
Description:P34995
Residue:402
BDBM50160907
NameBDBM50160907
Synonyms:5-[3-(2-Benzyloxy-5-chloro-phenyl)-thiophen-2-yl]-nicotinic acid | CHEMBL184947
TypeSmall organic molecule
Emp. Form.C23H16ClNO3S
Mol. Mass.421.896
SMILESOC(=O)c1cncc(c1)-c1sccc1-c1cc(Cl)ccc1OCc1ccccc1