Reaction Details
TargetThromboxane A2 receptor
LigandBDBM50160913
Substrate/Competitorn/a
Meas. Tech.ChEMBL_302705 (CHEMBL839577)
Ki 140±n/a nM
Citation Ducharme, YBlouin, MCarrière, MCChateauneuf, ACôté, BDenis, DFrenette, RGreig, GKargman, SLamontagne, SMartins, ENantel, FO'Neill, GSawyer, NMetters, KMFriesen, RW 2,3-Diarylthiophenes as selective EP1 receptor antagonists. Bioorg Med Chem Lett15:1155-60 (2005) 
 
Thromboxane A2 receptor
Name:Thromboxane A2 receptor
Type:Enyzme
Mol. Mass.:37445.28
Organism:Homo sapiens (Human)
Description:P21731
Residue:343
BDBM50160913
NameBDBM50160913
Synonyms:6-[3-(2-Benzyloxy-5-chloro-phenyl)-thiophen-2-yl]-pyridine-2-carboxylic acid | CHEMBL362851
TypeSmall organic molecule
Emp. Form.C23H16ClNO3S
Mol. Mass.421.896
SMILESOC(=O)c1cccc(n1)-c1sccc1-c1cc(Cl)ccc1OCc1ccccc1