Reaction Details
TargetProstaglandin E2 receptor EP1 subtype
LigandBDBM50160914
Substrate/Competitorn/a
Meas. Tech.ChEMBL_303322 (CHEMBL840047)
Ki 17±n/a nM
Citation Ducharme, YBlouin, MCarrière, MCChateauneuf, ACôté, BDenis, DFrenette, RGreig, GKargman, SLamontagne, SMartins, ENantel, FO'Neill, GSawyer, NMetters, KMFriesen, RW 2,3-Diarylthiophenes as selective EP1 receptor antagonists. Bioorg Med Chem Lett15:1155-60 (2005) 
 
Prostaglandin E2 receptor EP1 subtype
Name:Prostaglandin E2 receptor EP1 subtype
Type:Enzyme
Mol. Mass.:41834.57
Organism:Homo sapiens (Human)
Description:P34995
Residue:402
BDBM50160914
NameBDBM50160914
Synonyms:3-[3-(2-Benzyloxy-5-chloro-phenyl)-thiophen-2-yl]-N-(1-pyridin-3-yl-ethyl)-benzamide | CHEMBL360592
TypeSmall organic molecule
Emp. Form.C31H25ClN2O2S
Mol. Mass.525.06
SMILESCC(NC(=O)c1cccc(c1)-c1sccc1-c1cc(Cl)ccc1OCc1ccccc1)c1cccnc1