Reaction Details
TargetThromboxane A2 receptor
LigandBDBM50160912
Substrate/Competitorn/a
Meas. Tech.ChEMBL_302705 (CHEMBL839577)
Ki 120±n/a nM
Citation Ducharme, YBlouin, MCarrière, MCChateauneuf, ACôté, BDenis, DFrenette, RGreig, GKargman, SLamontagne, SMartins, ENantel, FO'Neill, GSawyer, NMetters, KMFriesen, RW 2,3-Diarylthiophenes as selective EP1 receptor antagonists. Bioorg Med Chem Lett15:1155-60 (2005) 
 
Thromboxane A2 receptor
Name:Thromboxane A2 receptor
Type:Enyzme
Mol. Mass.:37445.28
Organism:Homo sapiens (Human)
Description:P21731
Residue:343
BDBM50160912
NameBDBM50160912
Synonyms:1-{5-[3-(2-Benzyloxy-5-chloro-phenyl)-thiophen-2-yl]-pyridin-3-yl}-2,2,2-trifluoro-ethanol | CHEMBL182368
TypeSmall organic molecule
Emp. Form.C24H17ClF3NO2S
Mol. Mass.475.91
SMILESOC(c1cncc(c1)-c1sccc1-c1cc(Cl)ccc1OCc1ccccc1)C(F)(F)F