Reaction Details
TargetSteryl-sulfatase
LigandBDBM50134328
Substrate/Competitorn/a
Meas. Tech.ChEMBL_302806 (CHEMBL838514)
Ki 2400±n/a nM
Citation Lehr, PBillich, AWolff, BNussbaumer, P N-Acyl arylsulfonamides as novel, reversible inhibitors of human steroid sulfatase. Bioorg Med Chem Lett15:1235-8 (2005) 
 
Steryl-sulfatase
Name:Steryl-sulfatase
Type:Enzyme
Mol. Mass.:65503.66
Organism:Homo sapiens (Human)
Description:P08842
Residue:583
BDBM50134328
NameBDBM50134328
Synonyms:CHEMBL124349 Phenyl-acetic acid (1S,3R,5R)-8-(4-chloro-benzenesulfonylaminocarbonyl)-8-aza-bicyclo[3.2.1]oct-3-yl ester
TypeSmall organic molecule
Emp. Form.C22H23ClN2O5S
Mol. Mass.462.946
SMILESClc1ccc(cc1)S(=O)(=O)NC(=O)N1[C@H]2CC[C@@H]1C[C@@H](C2)OC(=O)Cc1ccccc1