Reaction Details
TargetPhospholipase A2, membrane associated
LigandBDBM50161293
Substrate/Competitorn/a
Meas. Tech.ChEMBL_306495 (CHEMBL828100)
IC50 6±n/a nM
Citation Sawyer, JSBeight, DWSmith, ECSnyder, DWChastain, MKTielking, RLHartley, LWCarlson, DG Carbocyclic[g]indole inhibitors of human nonpancreatic s-PLA2. J Med Chem48:893-6 (2005) 
 
Phospholipase A2, membrane associated
Name:Phospholipase A2, membrane associated
Type:Hydrolase
Mol. Mass.:16101.20
Organism:Homo sapiens (Human)
Description:The human nps PLA2 was cloned, and expressed in E. coli. There was a refolding process in the purification.
Residue:144
BDBM50161293
NameBDBM50161293
Synonyms:(3-Aminooxalyl-1-benzyl-2-methyl-1,6,7,8-tetrahydro-1-aza-as-indacen-4-yloxy)-acetic acid | CHEMBL361552
TypeSmall organic molecule
Emp. Form.C23H22N2O5
Mol. Mass.406.4312
SMILESCc1c(C(=O)C(N)=O)c2c(OCC(O)=O)cc3CCCc3c2n1Cc1ccccc1