Reaction Details
TargetProtein-tyrosine kinase 6
LigandBDBM4851
Substrate/Competitorn/a
Meas. Tech.ChEMBL_325116 (CHEMBL861048)
Kd 2700±n/a nM
Citation Fabian, MABiggs, WHTreiber, DKAtteridge, CEAzimioara, MDBenedetti, MGCarter, TACiceri, PEdeen, PTFloyd, MFord, JMGalvin, MGerlach, JLGrotzfeld, RMHerrgard, SInsko, DEInsko, MALai, AGLélias, JMMehta, SAMilanov, ZVVelasco, AMWodicka, LMPatel, HKZarrinkar, PPLockhart, DJ A small molecule-kinase interaction map for clinical kinase inhibitors. Nat Biotechnol23:329-36 (2005) 
 
Protein-tyrosine kinase 6
Name:Protein-tyrosine kinase 6
Type:Tyrosine-protein kinase
Mol. Mass.:51839.11
Organism:Homo sapiens (Human)
Description:n/a
Residue:451
BDBM4851
NameBDBM4851
Synonyms:(4-chlorophenyl)-[4-(4-pyridylmethyl)phthalazin-1-yl]amine CGP 79787 CHEMBL75232 N-(4-chlorophenyl)-4-(pyridin-4-ylmethyl)phthalazin-1-amine PTK787 cid_151194
TypeSmall organic molecule
Emp. Form.C20H15ClN4
Mol. Mass.346.813
SMILESClc1ccc(Nc2nnc(Cc3ccncc3)c3ccccc23)cc1