Reaction Details
TargetCyclin-dependent kinase 16
LigandBDBM13535
Substrate/Competitorn/a
Meas. Tech.ChEMBL_325029 (CHEMBL860663)
Kd 2400±n/a nM
Citation Fabian, MABiggs, WHTreiber, DKAtteridge, CEAzimioara, MDBenedetti, MGCarter, TACiceri, PEdeen, PTFloyd, MFord, JMGalvin, MGerlach, JLGrotzfeld, RMHerrgard, SInsko, DEInsko, MALai, AGLélias, JMMehta, SAMilanov, ZVVelasco, AMWodicka, LMPatel, HKZarrinkar, PPLockhart, DJ A small molecule-kinase interaction map for clinical kinase inhibitors. Nat Biotechnol23:329-36 (2005) 
 
Cyclin-dependent kinase 16
Name:Cyclin-dependent kinase 16
Type:Protein
Mol. Mass.:55721.58
Organism:Homo sapiens (Human)
Description:Q00536
Residue:496
BDBM13535
NameBDBM13535
Synonyms:4-[6-methoxy-7-(3-piperidin-1-ylpropoxy)quinazolin-4-yl]-N-(4-propan-2-yloxyphenyl)piperazine-1-carboxamide 4-[6-methoxy-7-[3-(1-piperidinyl)propoxy]-4-quinazolinyl]-N-(4-propan-2-yloxyphenyl)-1-piperazinecarboxamide CHEMBL124660 MLN518 cid_3038522
TypeSmall organic molecule
Emp. Form.C31H42N6O4
Mol. Mass.562.703
SMILESCOc1cc2c(ncnc2cc1OCCCN1CCCCC1)N1CCN(CC1)C(=O)Nc1ccc(OC(C)C)cc1