Reaction Details
TargetEphrin type-B receptor 1
LigandBDBM21
Substrate/Competitorn/a
Meas. Tech.ChEMBL_325031 (CHEMBL860665)
Kd 540±n/a nM
Citation Fabian, MABiggs, WHTreiber, DKAtteridge, CEAzimioara, MDBenedetti, MGCarter, TACiceri, PEdeen, PTFloyd, MFord, JMGalvin, MGerlach, JLGrotzfeld, RMHerrgard, SInsko, DEInsko, MALai, AGLélias, JMMehta, SAMilanov, ZVVelasco, AMWodicka, LMPatel, HKZarrinkar, PPLockhart, DJ A small molecule-kinase interaction map for clinical kinase inhibitors. Nat Biotechnol23:329-36 (2005) 
 
Ephrin type-B receptor 1
Name:Ephrin type-B receptor 1
Type:Enzyme Catalytic Domain
Mol. Mass.:109882.53
Organism:Homo sapiens (Human)
Description:EPH receptor B1 EPHB1 HUMAN::P54762
Residue:984
BDBM21
NameBDBM21
Synonyms:CHEMBL24828 VANDETANIB ZD6474 | cid_3081361
Typen/a
Emp. Form.C22H24BrFN4O2
Mol. Mass.475.354
SMILESCOc1cc2c(Nc3ccc(Br)cc3F)ncnc2cc1OCC1CCN(C)CC1