Reaction Details
TargetSerine/threonine-protein kinase MARK2
LigandBDBM17055
Substrate/Competitorn/a
Meas. Tech.ChEMBL_325049 (CHEMBL860785)
Kd 2300±n/a nM
Citation Fabian, MABiggs, WHTreiber, DKAtteridge, CEAzimioara, MDBenedetti, MGCarter, TACiceri, PEdeen, PTFloyd, MFord, JMGalvin, MGerlach, JLGrotzfeld, RMHerrgard, SInsko, DEInsko, MALai, AGLélias, JMMehta, SAMilanov, ZVVelasco, AMWodicka, LMPatel, HKZarrinkar, PPLockhart, DJ A small molecule-kinase interaction map for clinical kinase inhibitors. Nat Biotechnol23:329-36 (2005) 
 
Serine/threonine-protein kinase MARK2
Name:Serine/threonine-protein kinase MARK2
Type:PROTEIN
Mol. Mass.:87953.09
Organism:Homo sapiens (Human)
Description:ChEMBL_774586
Residue:788
BDBM17055
NameBDBM17055
Synonyms:(18S)-18-[(dimethylamino)methyl]-17-oxa-4,14,21-triazahexacyclo[19.6.1.1^{7,14}.0^{2,6}.0^{8,13}.0^{22,27}]nonacosa-1(28),2(6),7(29),8(13),9,11,22(27),23,25-nonaene-3,5-dione K00587a LY-333531 Ruboxistaurin | cid_153999
TypeSmall organic molecule
Emp. Form.C28H28N4O3
Mol. Mass.468.5469
SMILESCN(C)C[C@@H]1CCn2cc(C3=C(C(=O)NC3=O)c3cn(CCO1)c1ccccc31)c1ccccc21