Reaction Details
TargetKappa-type opioid receptor
LigandBDBM50161311
Substrate/Competitorn/a
Meas. Tech.ChEMBL_303532 (CHEMBL839646)
Ki 48±n/a nM
Citation Kumar, VGuo, DDaubert, JDCassel, JADeHaven, RNMansson, EDeHaven-Hudkins, DLMaycock, AL Amino acid conjugates as kappa opioid receptor agonists. Bioorg Med Chem Lett15:1279-82 (2005) 
 
Kappa-type opioid receptor
Name:Kappa-type opioid receptor
Type:G Protein-Coupled Receptor (GPCR)
Mol. Mass.:42648.76
Organism:Homo sapiens (Human)
Description:P41145
Residue:380
BDBM50161311
NameBDBM50161311
Synonyms:CHEMBL369720 | N-({[(S)-2-((R)-3-Hydroxy-pyrrolidin-1-yl)-1-phenyl-ethyl]-methyl-carbamoyl}-methyl)-4-methoxy-benzamide
TypeSmall organic molecule
Emp. Form.C23H29N3O4
Mol. Mass.411.4941
SMILESCOc1ccc(cc1)C(=O)NCC(=O)N(C)[C@H](CN1CC[C@@H](O)C1)c1ccccc1