Reaction Details
TargetKappa-type opioid receptor
LigandBDBM50161319
Substrate/Competitorn/a
Meas. Tech.ChEMBL_303532 (CHEMBL839646)
Ki 178±n/a nM
Citation Kumar, VGuo, DDaubert, JDCassel, JADeHaven, RNMansson, EDeHaven-Hudkins, DLMaycock, AL Amino acid conjugates as kappa opioid receptor agonists. Bioorg Med Chem Lett15:1279-82 (2005) 
 
Kappa-type opioid receptor
Name:Kappa-type opioid receptor
Type:G Protein-Coupled Receptor (GPCR)
Mol. Mass.:42648.76
Organism:Homo sapiens (Human)
Description:P41145
Residue:380
BDBM50161319
NameBDBM50161319
Synonyms:(S){[Methyl-(1-phenyl-2-pyrrolidin-1-yl-ethyl)-carbamoyl]-phenyl-methyl}-carbamic acid methyl ester | CHEMBL181509
TypeSmall organic molecule
Emp. Form.C23H29N3O3
Mol. Mass.395.4947
SMILESCOC(=O)N[C@H](C(=O)N(C)[C@H](CN1CCCC1)c1ccccc1)c1ccccc1