Reaction Details
TargetKappa-type opioid receptor
LigandBDBM50161317
Substrate/Competitorn/a
Meas. Tech.ChEMBL_310602 (CHEMBL837181)
EC50 0.76±n/a nM
Citation Kumar, VGuo, DDaubert, JDCassel, JADeHaven, RNMansson, EDeHaven-Hudkins, DLMaycock, AL Amino acid conjugates as kappa opioid receptor agonists. Bioorg Med Chem Lett15:1279-82 (2005) 
 
Kappa-type opioid receptor
Name:Kappa-type opioid receptor
Type:G Protein-Coupled Receptor (GPCR)
Mol. Mass.:42648.76
Organism:Homo sapiens (Human)
Description:P41145
Residue:380
BDBM50161317
NameBDBM50161317
Synonyms:3,4-Dichloro-N-({[(S)-2-((R)-3-hydroxy-pyrrolidin-1-yl)-1-phenyl-ethyl]-methyl-carbamoyl}-methyl)-benzamide | CHEMBL181941
TypeSmall organic molecule
Emp. Form.C22H25Cl2N3O3
Mol. Mass.450.358
SMILESCN([C@H](CN1CC[C@@H](O)C1)c1ccccc1)C(=O)CNC(=O)c1ccc(Cl)c(Cl)c1