Reaction Details
TargetKappa-type opioid receptor
LigandBDBM50161322
Substrate/Competitorn/a
Meas. Tech.ChEMBL_303532 (CHEMBL839646)
Ki 138±n/a nM
Citation Kumar, VGuo, DDaubert, JDCassel, JADeHaven, RNMansson, EDeHaven-Hudkins, DLMaycock, AL Amino acid conjugates as kappa opioid receptor agonists. Bioorg Med Chem Lett15:1279-82 (2005) 
 
Kappa-type opioid receptor
Name:Kappa-type opioid receptor
Type:G Protein-Coupled Receptor (GPCR)
Mol. Mass.:42648.76
Organism:Homo sapiens (Human)
Description:P41145
Residue:380
BDBM50161322
NameBDBM50161322
Synonyms:(RorS){[Methyl-(1-phenyl-2-pyrrolidin-1-yl-ethyl)-carbamoyl]-phenyl-methyl}-carbamic acid benzyl ester | CHEMBL368250
TypeSmall organic molecule
Emp. Form.C29H33N3O3
Mol. Mass.471.5906
SMILESCN([C@H](CN1CCCC1)c1ccccc1)C(=O)[C@@H](NC(=O)OCc1ccccc1)c1ccccc1